{"text_format":"1","workbook":"xlsx","n_sheets":9,"sheets":["Overview","User Control","Objections","Informational Network Issues","Network Development","Provider Types","Requirements","County Designations","Validation"],"not_rendered":{"charts":0,"images":0,"macros":1,"external_links":0,"defined_names":6,"comments":0,"pivot_tables":0},"unopened":[],"bounds":{"document_bytes":16777216,"sheet_cells":100000,"rows_first":2000,"rows_last":500,"rows_between":2000,"halvings":0,"cell_chars":16384,"cell_head_chars":4096},"cells_cut":0,"cells_raw":0,"read":"whole","date_system":"1900"}

{"sheet":"Overview","index":0,"n_rows":20,"n_cols":3,"rows_kept":20,"cut":false,"hidden":false,"merged":[[8,2,8,14],[2,2,2,14],[5,2,5,14],[6,2,6,14],[3,2,3,14],[18,2,18,14],[19,2,19,14],[15,2,15,14],[9,2,9,14],[10,2,10,14],[11,2,11,14],[13,2,13,14],[14,2,14,14],[16,2,16,14],[12,2,12,14]]}
[]
[]
[null,null,"PY2026 Provider Access Justifications"]
[null,null,"Updated 2025/03/14"]
[]
[null,null,"1. Overview and Purpose"]
[null,null,"Arkansas Insurance Department (AID) has reviewed the data you have submitted to assess compliance with CCIIO network adequacy standards. The Department has found at least one deficiency for a network/county/specialty combination. This template enables you to communicate why you cannot correct the deficiency(ies) or how you are working to correct the deficiency(ies).  "]
[]
[null,null,"2. Tab Descriptions"]
[null,null,"This template has a total of 8 tabs, but only the  tabs User Control, Objections, and Network Development (colored orange) should be used for data entry. Issuer should review and use tab Informational Network Issues for periodic monitoring over time.  All other worksheets located in this workbook are used to provide reference data and guidance on how to properly complete the template. Please review the descriptions of each worksheet below."]
[null,null,"User Control: This tab provides the Issuer with step-by-step instructions on how to successfully complete this template. Please review your issuer information, review the notes and instructions table and then begin following the step-by-step Actions."]
[null,null,"Objections: This tab lists the access deficiencies found in the issuer's network(s). Issuers must respond to each objection and take the indicated action before returning the justifications sheet. Note: Objections are only made if the computed coverage is below the required 90% and the potential for improvement based on all providers reported to AID is greater than 1%."]
[null,null,"Informational Network Issues: This tab lists areas where deficiencies in coverage are present, but where no significant improvement is possible due to lack of providers. Issuers are not required to respond, but are encouraged to engage in recruitment as possible and monitor areas for new providers."]
[null,null,"Network Development: This tab provides the Issuer an opportuinity to communicate the ongoing network improvement activities as a means to justifying deficiencies noted on the Objections sheet."]
[null,null,"Provider Types: A complete listing of all provider taxonomies, specialties, and corresponding requirment satisfaction."]
[null,null,"Requirements: Each requirement and the time and distance limit for each requirement based on the county designation."]
[null,null,"County Designations: All counties with their corresponding FIPS code and designation"]
[]
[null,null,"4. Conclusion"]
[null,null,"Please proceed to the User Control tab to begin. If you need any clarifications on the use of this template, please contact your Compliance Officer or email insurance.rhld@arkansas.gov."]
{"$rows_left_out":1}
{"sheet":"User Control","index":1,"n_rows":12,"n_cols":6,"rows_kept":12,"cut":false,"hidden":false,"merged":[[13,2,13,5],[1,2,1,5],[2,2,2,5],[4,2,4,3],[11,2,11,5],[12,2,12,5]]}
[]
[null,null,"Provider Access Justifications"]
[null,null,"User Instructions & Details"]
[]
[null,null,"Issuer Information"]
[null,null,"Issuer ID:",12345]
[null,null,"Market:","On-Market"]
[null,null,"Dental Only:","No"]
[null,null,"Date:","2025-02-28",null,"Not Validated"]
[]
[]
[null,null,"Notes & Instructions"]

{"sheet":"Objections","index":2,"n_rows":28,"n_cols":14,"rows_kept":28,"cut":false,"hidden":false,"merged":[[0,0,0,13]]}
["Network Adequacy Deficiencies and Issuer Responses"]
["HIOS ID","Network ID","County FIPS","County Name","County Designation","Criteria Code","Criteria Description","Requirement Metric","Computed Coverage","Possible Coverage","Issuer's Response","Multiple Responses","Issuer Action Required","Explanation of \"Other\" Reason"]
[12345,"ARN001",5003,"Ashley","Rural","P036","Plastic Surgery","Distance",0.70099999999999996,1,null,null,{"$f":"IF(ISNA(VLOOKUP(K3,Validation!A$3:B$10,2,FALSE)),\"\",VLOOKUP(K3,Validation!A$3:B$10,2,FALSE))","v":""}]
[12345,"ARN001",5007,"Benton","Metro","P039","Primary Care – Pediatric","Distance",0.86399999999999999,0.90800000000000003,null,null,{"$f":"IF(ISNA(VLOOKUP(K4,Validation!A$3:B$10,2,FALSE)),\"\",VLOOKUP(K4,Validation!A$3:B$10,2,FALSE))","v":""}]
[12345,"ARN001",5017,"Chicot","Rural","P037","Podiatry","Distance",0.66900000000000004,0.98299999999999998,null,null,{"$f":"IF(ISNA(VLOOKUP(K5,Validation!A$3:B$10,2,FALSE)),\"\",VLOOKUP(K5,Validation!A$3:B$10,2,FALSE))","v":""}]
[12345,"ARN001",5017,"Chicot","Rural","P036","Plastic Surgery","Distance",0.56399999999999995,1,null,null,{"$f":"IF(ISNA(VLOOKUP(K6,Validation!A$3:B$10,2,FALSE)),\"\",VLOOKUP(K6,Validation!A$3:B$10,2,FALSE))","v":""}]
[12345,"ARN001",5017,"Chicot","Rural","P027","Neurosurgery","Distance",3.3000000000000002E-2,1,null,null,{"$f":"IF(ISNA(VLOOKUP(K7,Validation!A$3:B$10,2,FALSE)),\"\",VLOOKUP(K7,Validation!A$3:B$10,2,FALSE))","v":""}]
[12345,"ARN001",5017,"Chicot","Rural","P043","Speech Therapy","Distance",0.68500000000000005,1,null,null,{"$f":"IF(ISNA(VLOOKUP(K8,Validation!A$3:B$10,2,FALSE)),\"\",VLOOKUP(K8,Validation!A$3:B$10,2,FALSE))","v":""}]
[12345,"ARN001",5021,"Clay","Rural","P023","Gynecology, OB/GYN","Distance",0.57299999999999995,0.88300000000000001,null,null,{"$f":"IF(ISNA(VLOOKUP(K9,Validation!A$3:B$10,2,FALSE)),\"\",VLOOKUP(K9,Validation!A$3:B$10,2,FALSE))","v":""}]
[12345,"ARN001",5027,"Columbia","Rural","P036","Plastic Surgery","Distance",8.9999999999999993E-3,1,null,null,{"$f":"IF(ISNA(VLOOKUP(K10,Validation!A$3:B$10,2,FALSE)),\"\",VLOOKUP(K10,Validation!A$3:B$10,2,FALSE))","v":""}]
[12345,"ARN001",5035,"Crittenden","Micro","P023","Gynecology, OB/GYN","Distance",0.78100000000000003,0.89800000000000002,null,null,{"$f":"IF(ISNA(VLOOKUP(K11,Validation!A$3:B$10,2,FALSE)),\"\",VLOOKUP(K11,Validation!A$3:B$10,2,FALSE))","v":""}]
[12345,"ARN001",5041,"Desha","Rural","P027","Neurosurgery","Distance",0.313,0.94799999999999995,null,null,{"$f":"IF(ISNA(VLOOKUP(K12,Validation!A$3:B$10,2,FALSE)),\"\",VLOOKUP(K12,Validation!A$3:B$10,2,FALSE))","v":""}]
[12345,"ARN001",5073,"Lafayette","Rural","P036","Plastic Surgery","Distance",1.6E-2,1,null,null,{"$f":"IF(ISNA(VLOOKUP(K13,Validation!A$3:B$10,2,FALSE)),\"\",VLOOKUP(K13,Validation!A$3:B$10,2,FALSE))","v":""}]
[12345,"ARN001",5077,"Lee","Rural","P012","Allergy and Immunology","Distance",0.28199999999999997,0.871,null,null,{"$f":"IF(ISNA(VLOOKUP(K14,Validation!A$3:B$10,2,FALSE)),\"\",VLOOKUP(K14,Validation!A$3:B$10,2,FALSE))","v":""}]
[12345,"ARN001",5085,"Lonoke","Micro","P023","Gynecology, OB/GYN","Distance",0.31900000000000001,0.436,null,null,{"$f":"IF(ISNA(VLOOKUP(K15,Validation!A$3:B$10,2,FALSE)),\"\",VLOOKUP(K15,Validation!A$3:B$10,2,FALSE))","v":""}]
[12345,"ARN001",5091,"Miller","Micro","P036","Plastic Surgery","Distance",0,3.9E-2,null,null,{"$f":"IF(ISNA(VLOOKUP(K16,Validation!A$3:B$10,2,FALSE)),\"\",VLOOKUP(K16,Validation!A$3:B$10,2,FALSE))","v":""}]
[12345,"ARN001",5093,"Mississippi","Rural","P023","Gynecology, OB/GYN","Distance",0.86799999999999999,0.92100000000000004,null,null,{"$f":"IF(ISNA(VLOOKUP(K17,Validation!A$3:B$10,2,FALSE)),\"\",VLOOKUP(K17,Validation!A$3:B$10,2,FALSE))","v":""}]
[12345,"ARN001",5107,"Phillips","Rural","F007","Mammography","Distance",0.312,0.76400000000000001,null,null,{"$f":"IF(ISNA(VLOOKUP(K18,Validation!A$3:B$10,2,FALSE)),\"\",VLOOKUP(K18,Validation!A$3:B$10,2,FALSE))","v":""}]
[12345,"ARN001",5107,"Phillips","Rural","P012","Allergy and Immunology","Distance",0,0.42699999999999999,null,null,{"$f":"IF(ISNA(VLOOKUP(K19,Validation!A$3:B$10,2,FALSE)),\"\",VLOOKUP(K19,Validation!A$3:B$10,2,FALSE))","v":""}]
[12345,"ARN001",5107,"Phillips","Rural","P036","Plastic Surgery","Distance",0.82199999999999995,1,null,null,{"$f":"IF(ISNA(VLOOKUP(K20,Validation!A$3:B$10,2,FALSE)),\"\",VLOOKUP(K20,Validation!A$3:B$10,2,FALSE))","v":""}]
{"$rows_left_out":9}
{"sheet":"Informational Network Issues","index":3,"n_rows":68,"n_cols":10,"rows_kept":68,"cut":false,"hidden":false,"merged":[[0,0,0,9],[1,0,1,9]]}
["Informational Network Adequacy Deficiencies* for ongoing monitoring"]
["   *(Deficiencies where data from all issuers combined indicated lack of enough provider(s)/provider location(s) for improvements)"]
["HIOS ID","Network ID","County FIPS","County Name","County Designation","Criteria Code","Criteria Description","Requirement Metric","Issuer's Coverage","Possible Coverage"]
[12345,"ARN001",5001,"Arkansas","Rural","P021","Gastroenterology","Distance",0.85599999999999998,0.85599999999999998]
[12345,"ARN001",5001,"Arkansas","Rural","P023","Gynecology, OB/GYN","Distance",0.875,0.875]
[12345,"ARN001",5001,"Arkansas","Rural","P037","Podiatry","Distance",0.84299999999999997,0.84299999999999997]
[12345,"ARN001",5003,"Ashley","Rural","P017","Dermatology","Distance",0.627,0.627]
[12345,"ARN001",5003,"Ashley","Rural","P039","Primary Care – Pediatric","Distance",0.89600000000000002,0.89600000000000002]
[12345,"ARN001",5003,"Ashley","Rural","P019","Endocrinology","Distance",0.41799999999999998,0.41799999999999998]
[12345,"ARN001",5007,"Benton","Metro","P023","Gynecology, OB/GYN","Distance",0.89900000000000002,0.89900000000000002]
[12345,"ARN001",5009,"Boone","Micro","P012","Allergy and Immunology","Distance",0.83699999999999997,0.83699999999999997]
[12345,"ARN001",5009,"Boone","Micro","P019","Endocrinology","Distance",0.49,0.49]
[12345,"ARN001",5017,"Chicot","Rural","P019","Endocrinology","Distance",0.52500000000000002,0.52500000000000002]
[12345,"ARN001",5017,"Chicot","Rural","P017","Dermatology","Distance",0,0]
[12345,"ARN001",5017,"Chicot","Rural","P039","Primary Care – Pediatric","Distance",0.89,0.89]
[12345,"ARN001",5023,"Cleburne","Rural","P023","Gynecology, OB/GYN","Distance",0.80300000000000005,0.80300000000000005]
[12345,"ARN001",5031,"Craighead","Metro","P023","Gynecology, OB/GYN","Distance",0.86099999999999999,0.86099999999999999]
[12345,"ARN001",5033,"Crawford","Metro","P039","Primary Care – Pediatric","Distance",0.39700000000000002,0.39900000000000002]
[12345,"ARN001",5033,"Crawford","Metro","P023","Gynecology, OB/GYN","Distance",0.55900000000000005,0.55900000000000005]
[12345,"ARN001",5033,"Crawford","Metro","P013","Cardiology","Distance",0.66200000000000003,0.66200000000000003]
{"$rows_left_out":49}
{"sheet":"Network Development","index":4,"n_rows":150,"n_cols":12,"rows_kept":150,"cut":false,"hidden":false,"merged":[[0,0,0,6],[7,0,7,11],[1,0,1,5],[2,0,2,5],[3,0,3,5],[4,0,4,5],[5,0,5,5]]}
["Monitoring and Mitigating Measures for Provider Network Gaps"]
["What sources do you use to monitor for new providers entering your service area? (enter all that apply)"]
["How often do you monitor your sources for new providers entering your service area?"]
["When you do not meet the network adequacy standards for a network/county/specialty combination, do you hold enrollees responsible for only in-network cost sharing for out-of-network care received?"]
["What is the number of enrollee complaints received regarding network adequacy during the prior Plan Year?"]
["What was the total enrollee PMPM covered through same network(s) during the prior Plan Year?"]
[]
["Recruitment Activity"]
["County FIPS","County Name","Criteria Met by Provider","NPI","Provider/Facility Name ","Street Address","City","State","ZIP","Provider's Point of Contact Phone Number","Status of Recruitment Efforts","Comments"]
[{"$f":"_xlfn.XLOOKUP(B10,'County Designations'!B$2:B$76,'County Designations'!A$2:A$76,\"\")","v":""}]
[{"$f":"_xlfn.XLOOKUP(B11,'County Designations'!B$2:B$76,'County Designations'!A$2:A$76,\"\")","v":""}]
[{"$f":"_xlfn.XLOOKUP(B12,'County Designations'!B$2:B$76,'County Designations'!A$2:A$76,\"\")","v":""}]
[{"$f":"_xlfn.XLOOKUP(B13,'County Designations'!B$2:B$76,'County Designations'!A$2:A$76,\"\")","v":""}]
[{"$f":"_xlfn.XLOOKUP(B14,'County Designations'!B$2:B$76,'County Designations'!A$2:A$76,\"\")","v":""}]
[{"$f":"_xlfn.XLOOKUP(B15,'County Designations'!B$2:B$76,'County Designations'!A$2:A$76,\"\")","v":""}]
[{"$f":"_xlfn.XLOOKUP(B16,'County Designations'!B$2:B$76,'County Designations'!A$2:A$76,\"\")","v":""}]
[{"$f":"_xlfn.XLOOKUP(B17,'County Designations'!B$2:B$76,'County Designations'!A$2:A$76,\"\")","v":""}]
[{"$f":"_xlfn.XLOOKUP(B18,'County Designations'!B$2:B$76,'County Designations'!A$2:A$76,\"\")","v":""}]
[{"$f":"_xlfn.XLOOKUP(B19,'County Designations'!B$2:B$76,'County Designations'!A$2:A$76,\"\")","v":""}]
[{"$f":"_xlfn.XLOOKUP(B20,'County Designations'!B$2:B$76,'County Designations'!A$2:A$76,\"\")","v":""}]
{"$rows_left_out":131}
{"sheet":"Provider Types","index":5,"n_rows":241,"n_cols":7,"rows_kept":241,"cut":false,"hidden":false,"merged":[[1,0,1,6],[0,0,0,6]]}
["Important Notes Regarding Taxonomy Codes"]
["CCIIO Notes on Provider Types\nWhen discussing provider types in the following section for network adequacy, the term “behavioral health” is to encompass mental health and substance use disorders.\n•  Under the limited circumstances described below, advanced practice registered nurses (APRNs) and physician assistants (PAs) can be included in the primary care providers adult and pediatric categories.\n•  Under the limited circumstances described below, APRNs who specialize in behavioral health services can be included in the outpatient clinical behavioral health provider category.\n• The purpose of including APRNs and PAs is to inform AID of the rare instances in which an issuer contracts with non-MD/DO primary care and behavioral health services providers in underserved counties to serve as the major source of these types of care for enrollees. In these instances, organizations may include submissions under primary care and outpatient clinical behavioral health specialty codes if the contracted APRN or PA satisfies the following conditions:\n          (1) currently licensed in the state; \n          (2) meets the state’s requirements governing the qualifications of that provider type; \n          (3) fully credentialed by the organization as a provider of primary care or behavioral health services; \n          (4) functions in accordance with state law as the primary source for the enrollee’s primary care or behavioral health services (i.e., not to supplement a physician’s care); and \n          (5) practices in or renders services to enrollees residing in a Health Professional Shortage Area.\n• Acute Inpatient Hospitals are defined as hospitals that provide all-day, year-round emergency services. "]
["Criteria Code","Type","Criteria Description","Specialty","Specialty Description","Taxonomy","Taxonomy Description"]
["F001 ","Facility","Acute Inpatient Hospitals",40,"General Acute Care Hospital","N/A       ","N/A"]
["F002 ","Facility","Cardiac Catheterization Services",42,"Cardiac Catheterization Services","N/A       ","N/A"]
["F003 ","Facility","Cardiac Surgery Program",41,"Cardiac Surgery Program","N/A       ","N/A"]
["F004 ","Facility","Critical Care Services",43,"Critical Care Services - Intensive Care Units (ICU)","N/A       ","N/A"]
["F005 ","Facility","Diagnostic Radiology",47,"Diagnostic Radiology ","261QM1200X","Magnetic Resonance Imaging (MRI) Clinic/Center"]
["F005 ","Facility","Diagnostic Radiology",47,"Diagnostic Radiology ","261QR0200X","Radiology Clinic/Center"]
["F006 ","Facility","Inpatient or Residential Behavioral Health Facility Services",52,"Inpatient Psychiatry","273R00000X","Psychiatric Hospital Unit"]
["F006 ","Facility","Inpatient or Residential Behavioral Health Facility Services",52,"Inpatient Psychiatry","283Q00000X","Psychiatric Hospital"]
["F006 ","Facility","Inpatient or Residential Behavioral Health Facility Services",72,"Substance Abuse Rehabilitation Facility","276400000X","Substance Use Disorder Rehabilitation Hospital Unit"]
["F006 ","Facility","Inpatient or Residential Behavioral Health Facility Services",72,"Substance Abuse Rehabilitation Facility","324500000X","Substance Abuse Rehabilitation Facility"]
["F006 ","Facility","Inpatient or Residential Behavioral Health Facility Services",76,"Mental Health Residential Treatment Facility","320800000X","Mental Illness Community Based Residential Treatment Facility"]
["F006 ","Facility","Inpatient or Residential Behavioral Health Facility Services","P072","Pediatric Substance Abuse Facility","3245S0500X","Children's Substance Abuse Rehabilitation Facility"]
["F006 ","Facility","Inpatient or Residential Behavioral Health Facility Services","P076","Children's Residential Treatment Facility","322D00000X","Emotionally Disturbed Childrens' Residential Treatment Facility"]
["F006 ","Facility","Inpatient or Residential Behavioral Health Facility Services","P076","Children's Residential Treatment Facility","323P00000X","Psychiatric Residential Treatment Facility"]
["F007 ","Facility","Mammography",48,"Mammography","261QR0206X","Mammography Clinic/Center"]
["F008 ","Facility","Outpatient Infusion/Chemotherapy",57,"Outpatient Infusion Therapy/Oncology/Radiology","261QI0500X","Infusion Therapy Clinic/Center"]
["F008 ","Facility","Outpatient Infusion/Chemotherapy",57,"Outpatient Infusion Therapy/Oncology/Radiology","261QX0200X","Oncology Clinic/Center"]
{"$rows_left_out":222}
{"sheet":"Requirements","index":6,"n_rows":47,"n_cols":13,"rows_kept":47,"cut":false,"hidden":false,"merged":[[0,3,0,4],[0,5,0,6],[0,7,0,8],[0,9,0,10],[0,11,0,12]]}
[null,null,"County Designation =>","Large Metro",null,"Metro",null,"Micro",null,"Rural",null,"CEAC"]
["Criteria Code","Type","Criteria Description","Distance","Time","Distance","Time","Distance","Time","Distance","Time","Distance","Time"]
["F001 ","Facility","Acute Inpatient Hospitals",10,20,30,45,60,80,60,75,100,110]
["F002 ","Facility","Cardiac Catheterization Services",15,30,40,60,120,160,120,145,140,155]
["F003 ","Facility","Cardiac Surgery Program",15,30,40,60,120,160,120,145,140,155]
["F004 ","Facility","Critical Care Services",10,20,30,45,120,160,120,145,140,155]
["F005 ","Facility","Diagnostic Radiology",10,20,30,45,60,80,60,75,100,110]
["F006 ","Facility","Inpatient or Residential Behavioral Health Facility Services",15,30,45,70,75,100,75,90,140,155]
["F007 ","Facility","Mammography",10,20,30,45,60,80,60,75,100,110]
["F008 ","Facility","Outpatient Infusion/Chemotherapy",10,20,30,45,60,80,60,75,100,110]
["F009 ","Facility","Skilled Nursing Facilities",10,20,30,45,60,80,60,75,85,95]
["F010 ","Facility","Surgical Services",10,20,30,45,60,80,60,75,100,110]
["F011 ","Facility","Urgent Care",10,20,30,45,60,80,60,75,100,110]
["P012 ","Individual","Allergy and Immunology",15,30,30,45,60,80,75,90,110,125]
["P013 ","Individual","Cardiology",10,20,20,30,35,50,60,75,85,95]
["P014 ","Individual","Cardiothoracic Surgery",15,30,40,60,75,100,90,110,130,145]
["P015 ","Individual","Chiropractor",15,30,30,45,60,80,75,90,110,125]
["P016 ","Individual","Dental",15,30,30,45,60,80,75,90,110,125]
["P017 ","Individual","Dermatology",10,20,30,45,45,60,60,75,100,110]
["P018 ","Individual","Emergency Medicine",10,20,30,45,60,80,60,75,100,110]
{"$rows_left_out":28}
{"sheet":"County Designations","index":7,"n_rows":76,"n_cols":3,"rows_kept":76,"cut":false,"hidden":false,"merged":[]}
["CountyFIPS","CountyName","Designation"]
[5001,"Arkansas","Rural"]
[5003,"Ashley","Rural"]
[5005,"Baxter","Micro"]
[5007,"Benton","Metro"]
[5009,"Boone","Micro"]
[5011,"Bradley","Rural"]
[5013,"Calhoun","CEAC"]
[5015,"Carroll","Rural"]
[5017,"Chicot","Rural"]
[5019,"Clark","Rural"]
[5021,"Clay","Rural"]
[5023,"Cleburne","Rural"]
[5025,"Cleveland","Rural"]
[5027,"Columbia","Rural"]
[5029,"Conway","Rural"]
[5031,"Craighead","Metro"]
[5033,"Crawford","Metro"]
[5035,"Crittenden","Micro"]
[5037,"Cross","Rural"]
{"$rows_left_out":57}
{"sheet":"Validation","index":8,"n_rows":47,"n_cols":9,"rows_kept":47,"cut":false,"hidden":false,"merged":[[0,4,0,8],[0,0,0,1]]}
["Objections Tab",null,null,null,"Network Development Tab"]
["Issuer Responses","Issuer Action Required",null,null,"Requirement",null,"Frequency","Cost Sharing","Recruitment"]
["PTNP updates needed for provider(s)","Include details in Network Development tab; suggest change(s) in next PTNP round and abide by the outcome of the process.",null,null,"F001 : Acute Inpatient Hospitals",null,"Daily","Yes. In-network cost sharing is used automatically.","Good faith offer rejected"]
["Existing providers were omitted from NA Template","List providers on Network Development tab and resubmit updated NA Template",null,null,"F002 : Cardiac Catheterization Services",null,"Weekly","Yes, but consumer must request in-network cost sharing.","Not licensed, accredited, or certified by the state"]
["Issuer disagrees with provider location reported by other issuers","Include provider NPI, criteria, and address in dispute along with reason on Network Development tab",null,null,"F003 : Cardiac Surgery Program",null,"Monthly","No. Out of network cost sharing always applies.","Moved/retired or facility closed"]
["Issuer is pursuing contract with provider(s)","Include details in Network Development tab",null,null,"F004 : Critical Care Services",null,"Every other month",null,"Does not contract with any commercial insurance organizations"]
["Available Provider(s) unwilling to contract","Include details in Network Development tab",null,null,"F005 : Diagnostic Radiology",null,"Quarterly",null,"Contract negotiations being conducted"]
["Available Provider(s) have not met credentialing or licensing requirements","Include details in Network Development tab",null,null,"F006 : Inpatient or Residential Behavioral Health Facility Services"]
["Available Provider(s) do not accept ARHome","Include details in Network Development tab",null,null,"F007 : Mammography"]
["Other","Include detailed explanation in comments =>",null,null,"F008 : Outpatient Infusion/Chemotherapy"]
[null,null,null,null,"F009 : Skilled Nursing Facilities"]
[null,null,null,null,"F010 : Surgical Services"]
[null,null,null,null,"F011 : Urgent Care"]
[null,null,null,null,"P012 : Allergy and Immunology"]
[null,null,null,null,"P013 : Cardiology"]
[null,null,null,null,"P014 : Cardiothoracic Surgery"]
[null,null,null,null,"P015 : Chiropractor"]
[null,null,null,null,"P016 : Dental"]
[null,null,null,null,"P017 : Dermatology"]
[null,null,null,null,"P018 : Emergency Medicine"]
{"$rows_left_out":27}